Syunik
preferred label: Sjunik @de

Kapan
type: Concept
in scheme: scheme
broader: Syunik
change note:
  comment: initial version
  created: 2026-06-18T13:09:03+00:00
  creator: Harald Allacher
definition: Capital of Syunik province (marz)
definition: Hauptstadt der Provinz (Marz) Sjunik @de