Kotayk
preferred label: Kotajk @de

Hrazdan
type: Concept
in scheme: scheme
preferred label: Hrasdan @de
alternative label: Razdan
broader: Kotayk
change note:
  comment: initial version
  created: 2026-06-18T13:06:23+00:00
  creator: Harald Allacher
definition: Capital of Kotayk province (marz)
definition: Hauptstadt der Provinz (Marz) Kotajk @de